{"text_format":"1","workbook":"xlsx","n_sheets":3,"sheets":["Calcul","Détail des calculs - STD","Détail des calculs - PERF"],"not_rendered":{"charts":0,"images":2,"macros":1,"external_links":0,"defined_names":50,"comments":0,"pivot_tables":0},"unopened":[],"bounds":{"document_bytes":16777216,"sheet_cells":100000,"rows_first":2000,"rows_last":500,"rows_between":2000,"halvings":0,"cell_chars":16384,"cell_head_chars":4096},"cells_cut":0,"cells_raw":0,"read":"whole","date_system":"1900"}

{"sheet":"Calcul","index":0,"n_rows":189,"n_cols":25,"rows_kept":189,"cut":false,"hidden":false,"merged":[[185,13,185,14],[185,0,185,5],[84,0,84,5],[188,0,188,5],[179,0,179,5],[173,3,173,4],[129,0,129,5],[77,0,77,5],[25,0,25,5],[48,0,48,5],[85,0,85,5],[0,0,0,5],[1,0,1,5],[2,0,2,5],[3,0,3,5],[22,0,22,1],[7,0,7,5],[13,0,13,1],[16,0,16,1],[19,0,19,1],[43,1,43,2],[39,1,39,2],[41,1,41,2]]}
[{"$f":"IF($H$6=1,U1,V1)","v":"Herzlich willkommen beim Online-Rechner des Kantons Wallis! "},null,null,null,null,null,null,null,null,null,null,null,null,null,null,null,null,null,null,null,"Bienvenue dans le calculateur en ligne des bourses et prêts d’études du canton du Valais. ","Herzlich willkommen beim Online-Rechner des Kantons Wallis! "]
[{"$f":"IF($H$6=1,U2,V2)","v":"Dieses Tool zur Berechnung Ihres Stipendien- oder Darlehensanspruchs wird Ihnen von der Sektion Stipendien und Ausbildungsdarlehen zur Verfügung gestellt."},null,null,null,null,null,null,null,null,null,null,null,null,null,null,null,null,null,null,null,"Ce calculateur est mis à disposition par la section des bourses et prêts d’études.","Dieses Tool zur Berechnung Ihres Stipendien- oder Darlehensanspruchs wird Ihnen von der Sektion Stipendien und Ausbildungsdarlehen zur Verfügung gestellt."]
[{"$f":"IF($H$6=1,U3,V3)","v":"Bitte beachten Sie, dass das errechnete Ergebnis unverbindlich ist und lediglich als Anhaltspunkt dient.\nDa sich die zuständige Behörde bei der Berechnung der Stipendien und Ausbildungsdarlehen auf die vom Antragsteller eingereichten Dokumente (wie Steuerverfügung der Eltern, Einkommen des Antragstellers, Anzahl unterhaltsberechtigter oder sich in Ausbildung befindlicher Kinder) stützt, hat das Ergebnis des Online-Rechners weder für die Kantonsverwaltung noch für die Kommission für Ausbildungsbeiträge eine Verpflichtung zur Folge."},null,null,null,null,null,null,null,null,null,null,null,null,null,null,null,null,null,null,null,"Le calcul des bourses et/ou prêt s d’études vous est présenté à titre indicatif !\nIl n'engage en aucun cas l'Administration cantonale, ni la Commission des Bourses et des Prêts d'études, car les bourses et prêts d’études sont calculés par l'autorité compétente sur la base des documents à fournir par le requérant, notamment la taxation définitive des parents, les gains du requérant, le nombre d’enfants à charge et en formation, etc...","Bitte beachten Sie, dass das errechnete Ergebnis unverbindlich ist und lediglich als Anhaltspunkt dient.\nDa sich die zuständige Behörde bei der Berechnung der Stipendien und Ausbildungsdarlehen auf die vom Antragsteller eingereichten Dokumente (wie Steuerverfügung der Eltern, Einkommen des Antragstellers, Anzahl unterhaltsberechtigter oder sich in Ausbildung befindlicher Kinder) stützt, hat das Ergebnis des Online-Rechners weder für die Kantonsverwaltung noch für die Kommission für Ausbildungsbeiträge eine Verpflichtung zur Folge."]
[{"$f":"IF($H$6=1,U4,V4)","v":"Das Resultat ist eine Schätzung, die sich auf die von Ihnen gemachten Angaben stützt. Ihre persönliche Situation kann vom Online-Rechner leider nicht berücksichtigt werden.\n\nUm die Berechnung durchzuführen, benötigen Sie die Steuerveranlagung Ihrer Eltern sowie das Einkommen, das Sie während des Schuljahrs allenfalls erarbeitet haben. Die Angaben sind jeweils für ein Ausbildungsjahr anzugeben.\nAuch kompliziertere Fälle, wie die Aufteilung von Kindern bei getrennt lebenden Eltern mit gemeinsamem Sorgerecht oder die Bestimmung einer teilweisen Unabhängigkeit von den elterlichen Leistungen, können vom Rechner bearbeitet werden. Eine unkorrekte Auslegung dieser Informationen Ihrerseits kann zu einem falschen Ergebnis führen.\n\nAuf Anfrage teilt Ihnen die Sektion Stipendien und Ausbildungsdarlehen gerne die weiteren Bedingungen für die Gewährung eines Stipendiums (Anerkennung der Ausbildung, Anerkennung der Bildungseinrichtung, Zuständigkeit des Kantons, ...) mit."},null,null,null,null,null,null,null,null,null,null,null,null,null,null,null,null,null,null,null,"Le résultat du calcul correspond à une estimation basée sur les données que vous allez insérer. Des éléments de votre situation personnelle peuvent ne pas être pris en considération par le calculateur.\n\nPour compléter le calcul, vous avez besoin de la taxation fiscale de vos parents et du montant de vos gains durant l’année scolaire. Les données sont à indiquer pour une année de formation complète.\nCertaines situations plus complexes, comme celles qui concernent la répartition des enfants dans les ménages lorsque les parents sont séparés, notamment lors de garde partagée ainsi que la détermination de l’indépendance partielle ou non des prestations parentales ont été intégrées au calculateur. Toutefois, elles peuvent être sujette à une interprétation erronée de votre part et conduire à un résultat incorrect.\n\nPour d’autres conditions à remplir pour l’octroi d’une bourse (reconnaissance de la formation, reconnaissance de l’établissement de formation, compétence du canton, …), veuillez contacter la section des bourses et prêts d'études.\n","Das Resultat ist eine Schätzung, die sich auf die von Ihnen gemachten Angaben stützt. Ihre persönliche Situation kann vom Online-Rechner leider nicht berücksichtigt werden.\n\nUm die Berechnung durchzuführen, benötigen Sie die Steuerveranlagung Ihrer Eltern sowie das Einkommen, das Sie während des Schuljahrs allenfalls erarbeitet haben. Die Angaben sind jeweils für ein Ausbildungsjahr anzugeben.\nAuch kompliziertere Fälle, wie die Aufteilung von Kindern bei getrennt lebenden Eltern mit gemeinsamem Sorgerecht oder die Bestimmung einer teilweisen Unabhängigkeit von den elterlichen Leistungen, können vom Rechner bearbeitet werden. Eine unkorrekte Auslegung dieser Informationen Ihrerseits kann zu einem falschen Ergebnis führen.\n\nAuf Anfrage teilt Ihnen die Sektion Stipendien und Ausbildungsdarlehen gerne die weiteren Bedingungen für die Gewährung eines Stipendiums (Anerkennung der Ausbildung, Anerkennung der Bildungseinrichtung, Zuständigkeit des Kantons, ...) mit."]
[null,null,null,null,null,null,null,null,null,null,null,null,null,"Année calculateur",{"$f":"IF(MONTH(O10)>=6,YEAR(O10)&\"/\"& YEAR(O10)+1,YEAR(O10)-1&\"/\"&YEAR(O10))","v":"2020/2021"}]
[{"$f":"IF($H$6=1,U6,V6)","v":"Schuljahr"},{"$f":"O5","v":"2020/2021"},null,null,null,"DE",null,{"$f":"VLOOKUP(F6,N5:N6:O7,2,FALSE)","v":2},null,null,null,null,null,"FR",1,null,null,null,null,null,"Année de formation","Schuljahr"]
[null,null,null,null,null,null,null,null,null,null,null,null,null,"DE",2]
[{"$f":"IF($H$6=1,U8,V8)","v":"Vervollständigen Sie bitte alle nachfolgenden Felder in grau, orange und grün.\n - Bei den grauen Feldern wählen Sie bitte eine Option aus.\n - In die orangen Felder geben Sie bitte eine ganze Zahl ein."},{"$f":"IF($H$6=1,V8,V9)","v":" - Dans les cellules vertes, vous devez saisir du texte.\n - In die grünen Felder geben Sie bitte einen Text ein."},{"$f":"IF($H$6=1,V9,X8)","v":0},0,0,0,null,null,null,null,null,null,null,null,null,null,null,null,null,null,"Veuillez compléter toutes les cellules de couleurs grises, oranges et vertes ci-dessous !\n - Dans les cellules en gris, vous devez sélectionner une des valeurs présentes.\n - Dans les cellules oranges, vous devez saisir des nombres entiers.","Vervollständigen Sie bitte alle nachfolgenden Felder in grau, orange und grün.\n - Bei den grauen Feldern wählen Sie bitte eine Option aus.\n - In die orangen Felder geben Sie bitte eine ganze Zahl ein."]
[null,null,null,null,null,null,null,null,null,null,null,null,null,null,null,null,"FR","DE",null,null,null," - Dans les cellules vertes, vous devez saisir du texte.\n - In die grünen Felder geben Sie bitte einen Text ein."]
[null,null,null,null,null,null,null,null,null,null,null,null,null,"Aujourd'hui",{"$f":"TODAY()","v":"2020-06-23"}]
[{"$f":"IF($H$6=1,U11,V11)","v":"Ausbildung und Kostenkategorie"},null,null,null,null,null,null,null,null,null,null,null,null,"Année taxation",{"$f":"IF(MONTH(O10)>=6,YEAR(O10)-2,YEAR(O10)-3)","v":2018},null,null,null,null,null,"Formation et catégorie de frais","Ausbildung und Kostenkategorie"]
[]
[{"$f":"IF($H$6=1,U13,V13)","v":"Art der geplanten Ausbildung"},null,null,null,null,null,null,null,null,null,null,null,null,{"$f":"IF($H$6=1,Q13,R13)","v":"Besuch einer OS-Klasse in einer anderen Sprachregion oder einer Sport-Kunst-Ausbildungsstruktur "},1,null,"Fréquentation d'une classe du cycle d'orientation dans une autre région linguistique ou d'une structure sport-arts-formation","Besuch einer OS-Klasse in einer anderen Sprachregion oder einer Sport-Kunst-Ausbildungsstruktur ",null,null,"Type de formation envisagée","Art der geplanten Ausbildung"]
["Mittelschulausbildung (Kollegium, FMS, HMS, ...) ",null,null,null,null,null,null,{"$f":"VLOOKUP(A14,N13:O19,2,FALSE)","v":1},null,null,null,null,null,{"$f":"IF($H$6=1,Q14,R14)","v":"Vorbereitende Schule (Schule für Berufsvorbereitung, ...) "},1,null,"Ecoles préparatoires (écoles préprofessionnelles, …)","Vorbereitende Schule (Schule für Berufsvorbereitung, ...) "]
[null,null,null,null,null,null,null,null,null,null,null,null,null,"Berufslehre ",1,null,"Apprentissage","Berufslehre "]
[{"$f":"IF($H$6=1,U16,V16)","v":"Kostenkategorie"},null,null,null,null,null,null,null,null,null,null,null,null,"Mittelschulausbildung (Kollegium, FMS, HMS, ...) ",1,null,"Formation secondaire du deuxième degré (Collège, ECCG…)","Mittelschulausbildung (Kollegium, FMS, HMS, ...) ",null,null,"Catégorie de frais","Kostenkategorie"]
["Mittagessen auswärts",null,null,null,null,null,null,{"$f":"VLOOKUP(A17,N21:O24,2,FALSE)","v":2},null,null,null,null,null,"Tertiäre Ausbildung",2,null,"Formation tertiaire","Tertiäre Ausbildung"]
[null,null,null,null,null,null,null,null,null,null,null,null,null,"Fernstudium (Tertiärstufe) ",3,null,"Formation à distance (tertiaire)","Fernstudium (Tertiärstufe) "]
[{"$f":"IF($H$6=1,U19,V19)","v":"Art der Schule"},null,null,null,null,null,null,null,null,null,null,null,null,"Berufsbegleitende Weiterbildungen",4,null,"Perfectionnement en emploi","Berufsbegleitende Weiterbildungen",null,null,"Type d'école","Art der Schule"]
["Öffentliche Schule",null,null,null,null,null,null,{"$f":"VLOOKUP(A20,N26:O27,2,FALSE)","v":1}]
[null,null,null,null,null,null,null,null,null,null,null,null,null,{"$f":"IF($H$6=1,Q21,R21)","v":"Mittagessen zuhause"},1,null,"Repas de midi à domicile","Mittagessen zuhause"]
[{"$f":"IF($H$6=1,U22,V22)","v":"Anzahl Semester während dem Ausbildungsjahr"},null,null,null,null,null,null,null,null,null,null,null,null,"Mittagessen auswärts",2,null,"Repas de midi hors domicile","Mittagessen auswärts",null,null,"Nombre de semestres durant l'année de formation","Anzahl Semester während dem Ausbildungsjahr"]
[2,null,null,null,null,null,null,{"$f":"VLOOKUP(A23,N29:O30,2,FALSE)","v":2},null,null,null,null,null,"Unterkunft und Verpflegung ausserhalb der Familie im Kanton",3,null,"Pension et logement hors de la famille dans le canton","Unterkunft und Verpflegung ausserhalb der Familie im Kanton"]
[null,null,null,null,null,null,null,null,null,null,null,null,null,"Unterkunft und Verpflegung ausserhalb des Kantons",4,null,"Pension et logement  hors du canton","Unterkunft und Verpflegung ausserhalb des Kantons"]
[{"$f":"IF($H$6=1,U25,V25)","v":"Schulkosten"},0,null,null,null,null,null,null,null,null,null,null,null,null,null,null,null,null,null,null,"Ecolage","Schulkosten"]
[{"$f":"IF($H$6=1,U26,V26)","v":"Nur ausfüllen, wenn es sich um eine berufsbegleitende Weiterbildung handelt (alle mit dem Kurs verbundenen Kosten einschliessen) oder die Ausbildung von einer Privatschule angeboten wird (nur Schulgeld)."},0,0,0,0,0,null,null,null,null,null,null,null,{"$f":"IF($H$6=1,Q26,R26)","v":"Öffentliche Schule"},1,null,"Publique","Öffentliche Schule",null,null,"A compléter uniquement s'il s'agit d'un perfectionnement en emploi (Inclure tous les frais liés au cours) ou si la formation est suivie dans une école privée (uniquement les frais d'écolage)","Nur ausfüllen, wenn es sich um eine berufsbegleitende Weiterbildung handelt (alle mit dem Kurs verbundenen Kosten einschliessen) oder die Ausbildung von einer Privatschule angeboten wird (nur Schulgeld)."]
[null,null,null,null,null,null,null,null,null,null,null,null,null,"Private Schule ",2,null,"Privée","Private Schule "]
[]
["Frais admis",{"$f":"IF(H14<>4,IF(AND(H20=2,B25>6000),VLOOKUP(H14,N33:R37,H17+1,FALSE)+MIN((B25-6000),5000),VLOOKUP(H14,N33:R37,H17+1,FALSE)),MIN(B25,16000))","v":6000},null,null,null,null,null,{"$f":"IF(H14<>4,VLOOKUP(H14,N33:R37,H17+1,FALSE),B25)","v":6000},"si \"publique\"",null,null,null,null,1,1,null,null,null,null,null,"Frais admis"]
[null,null,null,null,null,null,null,null,null,null,null,null,null,2,2,null,null,null,null,null,null,"Anerkannte Kosten"]
[]
[null,null,null,null,null,null,null,null,null,null,null,null,null,"Type","Repas domicile","Repas hors domicile","Logement VS","Logement hors VS"]
[null,null,null,null,null,null,null,null,null,null,null,null,null,"Formation",1,2,3,4,"Maximum "]
[null,null,null,null,null,null,null,null,null,null,null,null,null,1,4000,6000,10500,12000,17000]
[null,null,null,null,null,null,null,null,null,null,null,null,null,2,5000,7500,13500,16000,21000]
[null,null,null,null,null,null,null,null,null,null,null,null,null,3,5000,5000,5000,5000,10000]
[null,null,null,null,null,null,null,null,null,null,null,null,null,4,"Montant des frais liés au cours jusqu'à un maximum de 16'000",null,null,null,16000]
[{"$f":"IF($H$6=1,U38,V38)","v":"Situation der Person in Ausbildung"},null,null,null,null,null,null,null,null,null,null,null,null,null,null,null,null,null,null,null,"Situation de la personne en formation","Situation der Person in Ausbildung"]
[]
[{"$f":"IF($H$6=1,U40,V40)","v":"Name"},null,null,null,null,null,null,"Référence",null,null,null,null,null,{"$f":"IF($H$6=1,Q40,R40)","v":"Nein"},0,null,"Non","Nein",null,null,"Nom","Name"]
{"$rows_left_out":150}
{"sheet":"Détail des calculs - STD","index":1,"n_rows":119,"n_cols":8,"rows_kept":119,"cut":false,"hidden":true,"merged":[]}
[null,null,null,null,"Sion, le ",{"$f":"TODAY()","v":"2020-06-23"}]
["Détail des calculs"]
[]
["Année scolaire",null,{"$f":"Calcul!B6","v":"2020/2021"}]
[]
["N° Référence",null,{"$f":"Calcul!I40","v":0}]
["Nom - Prénom",null,{"$f":"CONCATENATE(Calcul!B40,\" \",Calcul!B42)","v":" "}]
["Etat civil",null,{"$f":"Calcul!B44","v":"Ledig"}]
[]
[]
["Besoins de la famille ",null,null,null,{"$f":"IF(Calcul!C76=1,\"Parents\",IF(Calcul!C76=2,\"Mère\",IF(Calcul!C76=3,\"Père\",\"Père\")))","v":"Père"},{"$f":"IF(Calcul!C76=4,\"Mère\",\"\")","v":""},null,"Ordonnance"]
["Nombre de parents",null,null,null,{"$f":"Calcul!C134","v":0},{"$f":"Calcul!D134","v":0}]
["Nombre d'enfants à charge",null,null,null,{"$f":"Calcul!C139","v":0},{"$f":"Calcul!D139","v":0}]
["Nombre de personnes dans le ménage",null,null,null,{"$f":"E12+E13","v":0},{"$f":"F12+F13","v":0}]
[]
["Nombre d'enfants en formation post-obligatoire",null,null,null,{"$f":"Calcul!C140","v":0},{"$f":"Calcul!D140","v":0}]
[]
["Besoins admis de la famille ",null,null,null,{"$f":"Calcul!C147","v":0},{"$f":"Calcul!D147","v":0},null,"Annexe II"]
["Supplément de formation (1'800.- / enfants en formation p.-o.)",null,null,null,{"$f":"Calcul!C148","v":0},{"$f":"Calcul!D148","v":0},null,"Art. 7.2"]
["Besoins de la famille",null,null,null,{"$f":"E18+E19","v":0},{"$f":"F18+F19","v":0}]
[]
[{"$f":"CONCATENATE(\"Revenu déterminant des parents   (Base : Taxation \", Calcul!O11, \")\")","v":"Revenu déterminant des parents   (Base : Taxation 2018)"}]
["Revenu net  (2400)",null,null,"+",{"$f":"Calcul!C89","v":0},{"$f":"Calcul!D89","v":0},null,"Art. 6.1"]
["Fortune brute  (3500)",null,null,null,{"$f":"Calcul!C90","v":0},{"$f":"Calcul!D90","v":0}]
["Bâtiment privés  (2920,2922)",null,null,null,{"$f":"Calcul!C93","v":0},{"$f":"Calcul!D93","v":0}]
["Fortune revalorisée brute",null,null,null,{"$f":"Calcul!C110","v":0},{"$f":"Calcul!D110","v":0}]
["Dette  (4000)",null,null,null,{"$f":"Calcul!C94","v":0},{"$f":"Calcul!D94","v":0}]
["Fortune revalorisée nette",null,null,null,{"$f":"Calcul!C111","v":0},{"$f":"Calcul!D111","v":0}]
["Revenu de la fortune (5 % fortune revalorisée nette)",null,null,"+",{"$f":"Calcul!C118","v":0},{"$f":"Calcul!D118","v":0}]
["Pilier 3a  (2210,2220)",null,null,"+",{"$f":"Calcul!C99","v":0},{"$f":"Calcul!D99","v":0}]
["Revenu négatif de la fortune immobilière  (1110,1120,1130)",null,null,"+",{"$f":"Calcul!C114","v":0},{"$f":"Calcul!D114","v":0}]
["Pensions alimentaires versées  (2531)",null,null,"-",{"$f":"Calcul!C104","v":0},{"$f":"Calcul!D104","v":0}]
["Prestations en capital reçues  (1010,1020)",null,null,"-",{"$f":"Calcul!C107","v":0},{"$f":"Calcul!D107","v":0}]
["Revenu déterminant calculé",null,null,null,{"$f":"E23+E29+E30+E31-E32-E33","v":0},{"$f":"F23+F29+F30+F31-F32-F33","v":0}]
[]
["Revenu déterminant",null,null,null,{"$f":"ROUNDDOWN(E34,-2)","v":0},{"$f":"ROUNDDOWN(F34,-2)","v":0}]
[]
["Contribution des parents"]
["Prise en compte des prestations parentales ",null,null,null,{"$f":"IF(E36<180000,IF(Calcul!H48=0,\"Oui\",\"Non\"),IF(Calcul!H48=1,\"Revenu >180'000\",\"Oui\"))","v":"Oui"},{"$f":"E39","v":"Oui"},null,{"$f":"IF(E39=\"Revenu >180'000\",\"Art. 12.3\",\"Art. 12\")","v":"Art. 12"}]
[]
{"$rows_left_out":80}
{"sheet":"Détail des calculs - PERF","index":2,"n_rows":78,"n_cols":13,"rows_kept":78,"cut":false,"hidden":true,"merged":[[19,7,46,7],[50,0,53,7]]}
[null,null,null,null,"Sion, le ",{"$f":"TODAY()","v":"2020-06-23"}]
["Détail des calculs"]
[]
["Année scolaire",null,{"$f":"Calcul!B6","v":"2020/2021"},null,null,null,null,null,null,null,null,"Célibataire","Ledig"]
[null,null,null,null,null,null,null,null,null,null,null,"Marié(e) ","Verheiratet"]
["N° Référence",null,{"$f":"Calcul!I40","v":0},null,null,null,null,null,null,null,null,"Divorcé(e) ","Geschieden"]
["Nom - Prénom",null,{"$f":"CONCATENATE(Calcul!B40,\" \",Calcul!B42)","v":" "},null,null,null,null,null,null,null,null,"Séparé(e) ","Getrennt"]
["Etat civil",null,{"$f":"Calcul!B44","v":"Ledig"},null,null,null,null,null,null,null,null,"Veuf(ve)","Witwer (Witwe)"]
[null,null,null,null,null,null,null,null,null,null,null,"Remarié(e) ","Wiederverheiratet"]
[null,null,null,null,null,null,null,null,null,null,null,"Partenariat enregistré","Eingetragene Partnerschaft"]
[]
["Calcul de l'allocation "]
[]
["Formation",null,{"$f":"VLOOKUP(C6,#REF!,10,FALSE)","v":{"$error":"#REF!"}},null,null,null,null,null,null,null,null,"Repas de midi à domicile","Mittagessen zuhause"]
["Lieu de formation",null,{"$f":"VLOOKUP(C6,#REF!,12,FALSE)","v":{"$error":"#REF!"}},null,null,null,null,null,null,null,null,"Repas de midi hors domicile","Mittagessen auswärts"]
["Type de formation",null,"Formation professionnelle supérieure",null,null,null,null,null,null,null,null,"Pension et logement hors famille","Unterkunft und Verpflegung ausserhalb der Familie"]
["Catégorie de frais",null,{"$f":"Calcul!A14","v":"Mittelschulausbildung (Kollegium, FMS, HMS, ...) "},null,null,null,null,null,null,null,null,"Pension et logement  hors canton","Unterkunft und Verpflegung ausserhalb des Kantons"]
["Nombre de semestres",null,{"$f":"Calcul!B173","v":2},null,null,null,null,null,null,null,null,"Formation à distance (tertiaire)","Fernstudium"]
[null,null,null,null,null,null,null,null,null,null,null,"Perfectionnement en emploi","Berufsbegleitende Weiterbildung"]
["Montant maximum de frais annuels admis ",null,null,null,{"$f":"Calcul!B29","v":6000},null,null,"Art. 14"]
[null,null,"Frais de repas",{"$f":"Calcul!B24","v":0}]
[null,null,"Frais de déplacement",{"$f":"Calcul!#REF!","v":{"$error":"#REF!"}}]
[null,null,"Frais de logement",{"$f":"Calcul!#REF!","v":{"$error":"#REF!"}}]
[null,null,"Inscription/Taxes/Ecolage",{"$f":"Calcul!#REF!","v":{"$error":"#REF!"}}]
[]
["Revenu brut maximum",null,null,null,{"$f":"IF(Calcul!H44=2,54000,36000)","v":36000}]
["Nombre d'enfants à charge du(de la) requérant(e )",null,null,{"$f":"Calcul!C46","v":0}]
["Supplément pour enfants à charge (+6'000.- /enfant)",null,null,null,{"$f":"D27*6000","v":0}]
["Revenu brut maximum admis",null,null,null,{"$f":"E26+E28","v":36000}]
[]
["Revenu brut annuel"]
["Revenu Requérant",null,null,null,{"$f":"Calcul!C57","v":0}]
["Revenu Conjoint",null,null,null,{"$f":"Calcul!C60","v":0}]
["Revenu brut  annuel",null,null,null,{"$f":"E32+E33","v":0}]
[]
[]
["Revenu brut maximum admis",null,null,null,{"$f":"E29","v":36000}]
["Revenus brut annuel",null,null,null,{"$f":"Calcul!C61","v":0}]
["Manque identifié",null,null,null,{"$f":"E29-E38","v":36000}]
[]
{"$rows_left_out":38}